Reaction Details
TargetSerine/threonine-protein kinase TNNI3K
LigandBDBM50245266
Substrate/Competitorn/a
Meas. Tech.ChEMBL_1674597 (CHEMBL4024626)
IC50 79±n/a nM
Citation Philp, JLawhorn, BGGraves, APShewchuk, LRivera, KLJolivette, LJHolt, DAGatto, GJKallander, LS 4,6-Diaminopyrimidines as Highly Preferred Troponin I-Interacting Kinase (TNNI3K) Inhibitors. J Med Chem61:3076-3088 (2018) 
 
Serine/threonine-protein kinase TNNI3K
Name:Serine/threonine-protein kinase TNNI3K
Type:Enzyme Catalytic Domain
Mol. Mass.:92855.14
Organism:Homo sapiens (Human)
Description:gi_7705748
Residue:835
BDBM50245266
NameBDBM50245266
Synonyms:CHEMBL4094583
TypeSmall organic molecule
Emp. Form.C17H16BrN5O2S
Mol. Mass.434.31
SMILESCNS(=O)(=O)c1cccc(Nc2cc(Nc3cccc(Br)c3)ncn2)c1