Reaction Details
TargetSerine/threonine-protein kinase TNNI3K
LigandBDBM50197804
Substrate/Competitorn/a
Meas. Tech.ChEMBL_1674597 (CHEMBL4024626)
IC50 79±n/a nM
Citation Philp, JLawhorn, BGGraves, APShewchuk, LRivera, KLJolivette, LJHolt, DAGatto, GJKallander, LS 4,6-Diaminopyrimidines as Highly Preferred Troponin I-Interacting Kinase (TNNI3K) Inhibitors. J Med Chem61:3076-3088 (2018) 
 
Serine/threonine-protein kinase TNNI3K
Name:Serine/threonine-protein kinase TNNI3K
Type:Enzyme Catalytic Domain
Mol. Mass.:92855.14
Organism:Homo sapiens (Human)
Description:gi_7705748
Residue:835
BDBM50197804
NameBDBM50197804
Synonyms:CHEMBL3894005
TypeSmall organic molecule
Emp. Form.C19H21ClN6O2S
Mol. Mass.432.927
SMILESCNS(=O)(=O)c1ccc(N(C)C)c(Nc2cc(Nc3ccc(Cl)cc3)ncn2)c1