Reaction Details
TargetSerine/threonine-protein kinase TNNI3K
LigandBDBM50245273
Substrate/Competitorn/a
Meas. Tech.ChEMBL_1674597 (CHEMBL4024626)
IC50 200±n/a nM
Citation Philp, JLawhorn, BGGraves, APShewchuk, LRivera, KLJolivette, LJHolt, DAGatto, GJKallander, LS 4,6-Diaminopyrimidines as Highly Preferred Troponin I-Interacting Kinase (TNNI3K) Inhibitors. J Med Chem61:3076-3088 (2018) 
 
Serine/threonine-protein kinase TNNI3K
Name:Serine/threonine-protein kinase TNNI3K
Type:Enzyme Catalytic Domain
Mol. Mass.:92855.14
Organism:Homo sapiens (Human)
Description:gi_7705748
Residue:835
BDBM50245273
NameBDBM50245273
Synonyms:CHEMBL4100539
TypeSmall organic molecule
Emp. Form.C18H19N5O4S2
Mol. Mass.433.505
SMILESCNS(=O)(=O)c1cccc(Nc2cc(Nc3cccc(c3)S(C)(=O)=O)ncn2)c1