Reaction Details
TargetSerine/threonine-protein kinase TNNI3K
LigandBDBM50197718
Substrate/Competitorn/a
Meas. Tech.ChEMBL_1674598 (CHEMBL4024627)
IC50 320±n/a nM
Citation Philp, JLawhorn, BGGraves, APShewchuk, LRivera, KLJolivette, LJHolt, DAGatto, GJKallander, LS 4,6-Diaminopyrimidines as Highly Preferred Troponin I-Interacting Kinase (TNNI3K) Inhibitors. J Med Chem61:3076-3088 (2018) 
 
Serine/threonine-protein kinase TNNI3K
Name:Serine/threonine-protein kinase TNNI3K
Type:Enzyme Catalytic Domain
Mol. Mass.:92855.14
Organism:Homo sapiens (Human)
Description:gi_7705748
Residue:835
BDBM50197718
NameBDBM50197718
Synonyms:CHEMBL3940073
TypeSmall organic molecule
Emp. Form.C18H15ClF3N5O3S
Mol. Mass.473.857
SMILESCNS(=O)(=O)c1ccc(OC(F)(F)F)c(Nc2cc(Nc3ccc(Cl)cc3)ncn2)c1