Reaction Details
TargetEpidermal growth factor receptor
LigandBDBM50245262
Substrate/Competitorn/a
Meas. Tech.ChEMBL_1674599 (CHEMBL4024628)
IC50 400±n/a nM
Citation Philp, JLawhorn, BGGraves, APShewchuk, LRivera, KLJolivette, LJHolt, DAGatto, GJKallander, LS 4,6-Diaminopyrimidines as Highly Preferred Troponin I-Interacting Kinase (TNNI3K) Inhibitors. J Med Chem61:3076-3088 (2018) 
 
Epidermal growth factor receptor
Name:Epidermal growth factor receptor
Type:Receptor Kinase Domain
Mol. Mass.:134279.59
Organism:Homo sapiens (Human)
Description:P00533
Residue:1210
BDBM50245262
NameBDBM50245262
Synonyms:CHEMBL4076602
TypeSmall organic molecule
Emp. Form.C21H25N5O2S
Mol. Mass.411.521
SMILESCNS(=O)(=O)c1cccc(Nc2cc(Nc3cccc(c3)C(C)(C)C)ncn2)c1