Reaction Details
TargetEpidermal growth factor receptor
LigandBDBM50245306
Substrate/Competitorn/a
Meas. Tech.ChEMBL_1674599 (CHEMBL4024628)
IC50 1600±n/a nM
Citation Philp, JLawhorn, BGGraves, APShewchuk, LRivera, KLJolivette, LJHolt, DAGatto, GJKallander, LS 4,6-Diaminopyrimidines as Highly Preferred Troponin I-Interacting Kinase (TNNI3K) Inhibitors. J Med Chem61:3076-3088 (2018) 
 
Epidermal growth factor receptor
Name:Epidermal growth factor receptor
Type:Receptor Kinase Domain
Mol. Mass.:134279.59
Organism:Homo sapiens (Human)
Description:P00533
Residue:1210
BDBM50245306
NameBDBM50245306
Synonyms:CHEMBL4105656
TypeSmall organic molecule
Emp. Form.C18H20N6O4S2
Mol. Mass.448.519
SMILESCNS(=O)(=O)c1cccc(Nc2cc(Nc3cccc(c3)S(=O)(=O)NC)ncn2)c1