Reaction Details
TargetSerine/threonine-protein kinase B-raf
LigandBDBM50245316
Substrate/Competitorn/a
Meas. Tech.ChEMBL_1674604 (CHEMBL4024633)
IC50 2000±n/a nM
Citation Philp, JLawhorn, BGGraves, APShewchuk, LRivera, KLJolivette, LJHolt, DAGatto, GJKallander, LS 4,6-Diaminopyrimidines as Highly Preferred Troponin I-Interacting Kinase (TNNI3K) Inhibitors. J Med Chem61:3076-3088 (2018) 
 
Serine/threonine-protein kinase B-raf
Name:Serine/threonine-protein kinase B-raf
Type:Serine/threonine-protein kinase
Mol. Mass.:84446.00
Organism:Homo sapiens (Human)
Description:P15056
Residue:766
BDBM50245316
NameBDBM50245316
Synonyms:CHEMBL4091362
TypeSmall organic molecule
Emp. Form.C20H23ClN6O4S2
Mol. Mass.511.017
SMILESCNS(=O)(=O)c1ccc(c(Nc2cc(Nc3ccc(Cl)cn3)ncn2)c1)S(=O)(=O)C(C)(C)C