Reaction Details
TargetSerine/threonine-protein kinase TNNI3K
LigandBDBM50197802
Substrate/Competitorn/a
Meas. Tech.ChEMBL_1674597 (CHEMBL4024626)
IC50 400±n/a nM
Citation Philp, JLawhorn, BGGraves, APShewchuk, LRivera, KLJolivette, LJHolt, DAGatto, GJKallander, LS 4,6-Diaminopyrimidines as Highly Preferred Troponin I-Interacting Kinase (TNNI3K) Inhibitors. J Med Chem61:3076-3088 (2018) 
 
Serine/threonine-protein kinase TNNI3K
Name:Serine/threonine-protein kinase TNNI3K
Type:Enzyme Catalytic Domain
Mol. Mass.:92855.14
Organism:Homo sapiens (Human)
Description:gi_7705748
Residue:835
BDBM50197802
NameBDBM50197802
Synonyms:CHEMBL3948258
TypeSmall organic molecule
Emp. Form.C18H18ClN5O2S2
Mol. Mass.435.951
SMILESCNS(=O)(=O)c1ccc(SC)c(Nc2cc(Nc3ccc(Cl)cc3)ncn2)c1