Reaction Details
TargetEndoplasmic reticulum aminopeptidase 1
LigandBDBM50245391
Substrate/Competitorn/a
Meas. Tech.ChEMBL_1674662 (CHEMBL4024805)
IC50 33±n/a nM
Citation Kokkala, PMpakali, AMauvais, FXPapakyriakou, ADaskalaki, IPetropoulou, IKavvalou, SPapathanasopoulou, MAgrotis, SFonsou, TMvan Endert, PStratikos, EGeorgiadis, D Optimization and Structure-Activity Relationships of Phosphinic Pseudotripeptide Inhibitors of Aminopeptidases That Generate Antigenic Peptides. J Med Chem59:9107-9123 (2016) 
 
Endoplasmic reticulum aminopeptidase 1
Name:Endoplasmic reticulum aminopeptidase 1
Type:PROTEIN
Mol. Mass.:107232.03
Organism:Homo sapiens (Human)
Description:ChEMBL_1473167
Residue:941
BDBM50245391
NameBDBM50245391
Synonyms:CHEMBL4095882
TypeSmall organic molecule
Emp. Form.C31H35N4O6P
Mol. Mass.590.6066
SMILESN[C@@H](CCc1ccccc1)P(O)(=O)C[C@@H](Cc1cc(no1)-c1ccc(O)cc1)C(=O)N[C@@H](Cc1ccccc1)C(N)=O