Reaction Details
TargetLeucyl-cystinyl aminopeptidase
LigandBDBM50245400
Substrate/Competitorn/a
Meas. Tech.ChEMBL_1674664 (CHEMBL4024807)
IC50 10.0±n/a nM
Citation Kokkala, PMpakali, AMauvais, FXPapakyriakou, ADaskalaki, IPetropoulou, IKavvalou, SPapathanasopoulou, MAgrotis, SFonsou, TMvan Endert, PStratikos, EGeorgiadis, D Optimization and Structure-Activity Relationships of Phosphinic Pseudotripeptide Inhibitors of Aminopeptidases That Generate Antigenic Peptides. J Med Chem59:9107-9123 (2016) 
 
Leucyl-cystinyl aminopeptidase
Name:Leucyl-cystinyl aminopeptidase
Type:PROTEIN
Mol. Mass.:117334.10
Organism:Homo sapiens (Human)
Description:ChEMBL_1473494
Residue:1025
BDBM50245400
NameBDBM50245400
Synonyms:CHEMBL4099107
TypeSmall organic molecule
Emp. Form.C32H37N4O6P
Mol. Mass.604.6331
SMILESCOc1ccc(cc1)-c1cc(C[C@H](CP(O)(=O)[C@@H](N)CCc2ccccc2)C(=O)N[C@@H](Cc2ccccc2)C(N)=O)on1