Reaction Details
TargetLeucyl-cystinyl aminopeptidase
LigandBDBM50245390
Substrate/Competitorn/a
Meas. Tech.ChEMBL_1674664 (CHEMBL4024807)
IC50 9.0±n/a nM
Citation Kokkala, PMpakali, AMauvais, FXPapakyriakou, ADaskalaki, IPetropoulou, IKavvalou, SPapathanasopoulou, MAgrotis, SFonsou, TMvan Endert, PStratikos, EGeorgiadis, D Optimization and Structure-Activity Relationships of Phosphinic Pseudotripeptide Inhibitors of Aminopeptidases That Generate Antigenic Peptides. J Med Chem59:9107-9123 (2016) 
 
Leucyl-cystinyl aminopeptidase
Name:Leucyl-cystinyl aminopeptidase
Type:PROTEIN
Mol. Mass.:117334.10
Organism:Homo sapiens (Human)
Description:ChEMBL_1473494
Residue:1025
BDBM50245390
NameBDBM50245390
Synonyms:CHEMBL4077855
TypeSmall organic molecule
Emp. Form.C31H35N4O6P
Mol. Mass.590.6066
SMILESN[C@@H](CCc1ccccc1)P(O)(=O)C[C@@H](Cc1cc(no1)-c1ccccc1O)C(=O)N[C@@H](Cc1ccccc1)C(N)=O