Reaction Details
TargetEpidermal growth factor receptor
LigandBDBM149404
Substrate/Competitorn/a
Meas. Tech.ChEMBL_1674679 (CHEMBL4024822)
Ki 303±n/a nM
Citation Jackson, PAWiden, JCHarki, DABrummond, KM Covalent Modifiers: A Chemical Perspective on the Reactivity of?,?-Unsaturated Carbonyls with Thiols via Hetero-Michael Addition Reactions. J Med Chem60:839-885 (2017) 
 
Epidermal growth factor receptor
Name:Epidermal growth factor receptor
Type:Receptor Kinase Domain
Mol. Mass.:134279.59
Organism:Homo sapiens (Human)
Description:P00533
Residue:1210
BDBM149404
NameBDBM149404
Synonyms:AVL-301 CNX-419 Rociletinib US10167264, Compound CO-1686 US10434101, Compound I-4 US8975249, I-4 | US9783524, CO-1686
TypeSmall organic molecule
Emp. Form.C27H28F3N7O3
Mol. Mass.555.5515
SMILESCOc1cc(ccc1Nc1ncc(c(Nc2cccc(NC(=O)C=C)c2)n1)C(F)(F)F)N1CCN(CC1)C(C)=O