Reaction Details
TargetSteroid 17-alpha-hydroxylase/17,20 lyase
LigandBDBM50245656
Substrate/Competitorn/a
Meas. Tech.ChEMBL_1675507 (CHEMBL4025650)
IC50 16±n/a nM
Citation Wang, MFang, YGu, SChen, FZhu, ZSun, XZhu, J Discovery of novel 1,2,3,4-tetrahydrobenzo[4, 5]thieno[2, 3-c]pyridine derivatives as potent and selective CYP17 inhibitors. Eur J Med Chem132:157-172 (2017) 
 
Steroid 17-alpha-hydroxylase/17,20 lyase
Name:Steroid 17-alpha-hydroxylase/17,20 lyase
Type:Enzyme
Mol. Mass.:57255.68
Organism:Rattus norvegicus (Rat)
Description:P11715
Residue:507
BDBM50245656
NameBDBM50245656
Synonyms:CHEMBL4059780
TypeSmall organic molecule
Emp. Form.C18H17FN2S
Mol. Mass.312.404
SMILESCc1ccncc1CN1CCc2c(C1)sc1ccc(F)cc21