Reaction Details
TargetEpidermal growth factor receptor
LigandBDBM50245701
Substrate/Competitorn/a
Meas. Tech.ChEMBL_1675765 (CHEMBL4025908)
IC50 3210±n/a nM
Citation Patel, HMPawara, RAnsari, ANoolvi, MSurana, S Design and synthesis of quinazolinones as EGFR inhibitors to overcome EGFR resistance obstacle. Bioorg Med Chem25:2713-2723 (2017) 
 
Epidermal growth factor receptor
Name:Epidermal growth factor receptor
Type:Receptor Kinase Domain
Mol. Mass.:134279.59
Organism:Homo sapiens (Human)
Description:P00533
Residue:1210
BDBM50245701
NameBDBM50245701
Synonyms:CHEMBL4083467
TypeSmall organic molecule
Emp. Form.C17H11ClN4OS
Mol. Mass.354.813
SMILESCc1nnc(s1)-n1c(nc2cc(Cl)ccc2c1=O)-c1ccccc1