Reaction Details
TargetEpidermal growth factor receptor
LigandBDBM50245703
Substrate/Competitorn/a
Meas. Tech.ChEMBL_1675765 (CHEMBL4025908)
IC50 320±n/a nM
Citation Patel, HMPawara, RAnsari, ANoolvi, MSurana, S Design and synthesis of quinazolinones as EGFR inhibitors to overcome EGFR resistance obstacle. Bioorg Med Chem25:2713-2723 (2017) 
 
Epidermal growth factor receptor
Name:Epidermal growth factor receptor
Type:Receptor Kinase Domain
Mol. Mass.:134279.59
Organism:Homo sapiens (Human)
Description:P00533
Residue:1210
BDBM50245703
NameBDBM50245703
Synonyms:CHEMBL4103440
TypeSmall organic molecule
Emp. Form.C23H15ClN4O2S
Mol. Mass.446.909
SMILESCOc1ccc(cc1)-c1nnc(s1)-n1c(nc2cc(Cl)ccc2c1=O)-c1ccccc1