Reaction Details
TargetEpidermal growth factor receptor
LigandBDBM50245706
Substrate/Competitorn/a
Meas. Tech.ChEMBL_1675765 (CHEMBL4025908)
IC50 34320±n/a nM
Citation Patel, HMPawara, RAnsari, ANoolvi, MSurana, S Design and synthesis of quinazolinones as EGFR inhibitors to overcome EGFR resistance obstacle. Bioorg Med Chem25:2713-2723 (2017) 
 
Epidermal growth factor receptor
Name:Epidermal growth factor receptor
Type:Receptor Kinase Domain
Mol. Mass.:134279.59
Organism:Homo sapiens (Human)
Description:P00533
Residue:1210
BDBM50245706
NameBDBM50245706
Synonyms:CHEMBL4072392
TypeSmall organic molecule
Emp. Form.C22H15ClN2O2
Mol. Mass.374.82
SMILESCC(=O)c1ccccc1-n1c(nc2cc(Cl)ccc2c1=O)-c1ccccc1