Reaction Details
TargetCarbonic anhydrase 2
LigandBDBM50245818
Substrate/Competitorn/a
Meas. Tech.ChEBML_1675879
Ki 0.820000±n/a nM
Citation Bozdag, MAlafeefy, AMAltamimi, AMCarta, FSupuran, CTVullo, D Synthesis of new 3-(2-mercapto-4-oxo-4H-quinazolin-3-yl)-benzenesulfonamides with strong inhibition properties against the tumor associated carbonic anhydrases IX and XII. Bioorg Med Chem25:2782-2788 (2017) 
 
Carbonic anhydrase 2
Name:Carbonic anhydrase 2
Type:Enzyme
Mol. Mass.:29250.71
Organism:Homo sapiens (Human)
Description:P00918
Residue:260
BDBM50245818
NameBDBM50245818
Synonyms:CHEMBL4077440
TypeSmall organic molecule
Emp. Form.C14H10BrN3O3S2
Mol. Mass.412.282
SMILESNS(=O)(=O)c1cccc(c1)-n1c(S)nc2c(Br)cccc2c1=O