Reaction Details
TargetCytochrome P450 3A4
LigandBDBM31768
Substrate/Competitorn/a
Meas. Tech.ChEMBL_4333 (CHEMBL883800)
IC50 786±n/a nM
Citation Rotstein, DMKertesz, DJWalker, KASwinney, DC Stereoisomers of ketoconazole: preparation and biological activity. J Med Chem35:2818-25 (1992) Cytochrome P450 3A4
Name:Cytochrome P450 3A4
Type:Enzyme
Mol. Mass.:57349.57
Organism:Homo sapiens (Human)
Description:n/a
Residue:503
BDBM31768
NameBDBM31768
Synonyms:CHEMBL295698 Nizoral | Panfungol
TypeSmall organic molecule
Emp. Form.C26H28Cl2N4O4
Mol. Mass.531.431
SMILESCC(=O)N1CCN(CC1)c1ccc(OC[C@@H]2CO[C@](Cn3ccnc3)(O2)c2ccc(Cl)cc2Cl)cc1