Reaction Details
TargetCytochrome P450 2C9
LigandBDBM50246760
Substrate/Competitorn/a
Meas. Tech.ChEMBL_1676808 (CHEMBL4026951)
EC50>100000±n/a nM
Citation Van der Plas, SEKelgtermans, HDe Munck, TMartina, SLXDropsit, SQuinton, EDe Blieck, AJoannesse, CTomaskovic, LJans, MChristophe, Tvan der Aar, EBorgonovi, MNelles, LGees, MStouten, PVan Der Schueren, JMammoliti, OConrath, KAndrews, M Discovery of N-(3-Carbamoyl-5,5,7,7-tetramethyl-5,7-dihydro-4H-thieno[2,3-c]pyran-2-yl)-lH-pyrazole-5-carboxamide (GLPG1837), a Novel Potentiator Which Can Open Class III Mutant Cystic Fibrosis Transmembrane Conductance Regulator (CFTR) Channels to a High Extent. J Med Chem61:1425-1435 (2018) 
 
Cytochrome P450 2C9
Name:Cytochrome P450 2C9
Type:Enzyme
Mol. Mass.:55636.33
Organism:Homo sapiens (Human)
Description:P11712
Residue:490
BDBM50246760
NameBDBM50246760
Synonyms:CHEMBL4075348
TypeSmall organic molecule
Emp. Form.C16H20N4O3S
Mol. Mass.348.42
SMILESCC1(C)Cc2c(sc(NC(=O)c3ccn[nH]3)c2C(N)=O)C(C)(C)O1