Reaction Details
TargetPhospholipase A2, major isoenzyme
LigandBDBM50004505
Substrate/Competitorn/a
Meas. Tech.ChEBML_156346
IC50 4500±n/a nM
Citation Bennion, CConnolly, SGensmantel, NPHallam, CJackson, CGPrimrose, WURoberts, GCRobinson, DHSlaich, PK Design and synthesis of some substrate analogue inhibitors of phospholipase A2 and investigations by NMR and molecular modeling into the binding interactions in the enzyme-inhibitor complex. J Med Chem35:2939-51 (1992) Phospholipase A2, major isoenzyme
Name:Phospholipase A2, major isoenzyme
Type:Hydrolase; monomer or homodimer
Mol. Mass.:16279.83
Organism:Sus scrofa (pig)
Description:Purchased from Sigma.
Residue:146
BDBM50004505
NameBDBM50004505
Synonyms:(S)-O-(2-Hexadecanamidoisohexyl) phosphocholine | CHEMBL101828
TypeSmall organic molecule
Emp. Form.C27H57N2O5P
Mol. Mass.520.7256
(=O)N[C@H](COP([O-])(=O)OCC[N+](C)(C)C)CC(C)C