Reaction Details
TargetMuscarinic acetylcholine receptor M2
LigandBDBM50004659
Substrate/Competitorn/a
Meas. Tech.ChEMBL_140039 (CHEMBL744019)
IC50 600±n/a nM
Citation Valli, MJTang, YKosh, JWChapman, JMSowell, JW Synthesis and cholinergic properties of N-aryl-2-[[[5-[(dimethylamino)methyl]-2-furanyl]methyl]thio]ethylamino analogs of ranitidine. J Med Chem35:3141-7 (1992) Muscarinic acetylcholine receptor M2
Name:Muscarinic acetylcholine receptor M2
Type:Enzyme Catalytic Domain
Mol. Mass.:51555.53
Organism:RAT
Description:P10980
Residue:466
BDBM50004659
NameBDBM50004659
Synonyms:CHEMBL321808 | [2-(5-Dimethylaminomethyl-furan-2-ylmethylsulfanyl)-ethyl]-(4-nitro-pyridazin-3-yl)-amine
TypeSmall organic molecule
Emp. Form.C14H19N5O3S
Mol. Mass.337.397
SMILESCN(C)Cc1ccc(CSCCNc2nnccc2[N+]([O-])=O)o1