Reaction Details
TargetMuscarinic acetylcholine receptor M1
LigandBDBM50004657
Substrate/Competitorn/a
Meas. Tech.ChEBML_138550
IC50 1800±n/a nM
Citation Valli, MJTang, YKosh, JWChapman, JMSowell, JW Synthesis and cholinergic properties of N-aryl-2-[[[5-[(dimethylamino)methyl]-2-furanyl]methyl]thio]ethylamino analogs of ranitidine. J Med Chem35:3141-7 (1992) Muscarinic acetylcholine receptor M1
Name:Muscarinic acetylcholine receptor M1
Type:Enzyme Catalytic Domain
Mol. Mass.:51400.50
Organism:Mus musculus
Description:Cholinergic, muscarinic 0 0::Q52KQ0
Residue:460
BDBM50004657
NameBDBM50004657
Synonyms:CHEMBL104681 | [2-(5-Dimethylaminomethyl-furan-2-ylmethylsulfanyl)-ethyl]-(5-fluoro-2,4-dinitro-phenyl)-amine
TypeSmall organic molecule
Emp. Form.C16H19FN4O5S
Mol. Mass.398.409
SMILESCN(C)Cc1ccc(CSCCNc2cc(F)c(cc2[N+]([O-])=O)[N+]([O-])=O)o1