Reaction Details
TargetMuscarinic acetylcholine receptor M2
LigandBDBM50004661
Substrate/Competitorn/a
Meas. Tech.ChEMBL_140041 (CHEMBL744021)
IC50 5700±n/a nM
Citation Valli, MJTang, YKosh, JWChapman, JMSowell, JW Synthesis and cholinergic properties of N-aryl-2-[[[5-[(dimethylamino)methyl]-2-furanyl]methyl]thio]ethylamino analogs of ranitidine. J Med Chem35:3141-7 (1992) Muscarinic acetylcholine receptor M2
Name:Muscarinic acetylcholine receptor M2
Type:Enzyme Catalytic Domain
Mol. Mass.:51555.53
Organism:RAT
Description:P10980
Residue:466
BDBM50004661
NameBDBM50004661
Synonyms:CHEMBL316973 | [2-(5-Dimethylaminomethyl-furan-2-ylmethylsulfanyl)-ethyl]-(2,4-dinitro-phenyl)-amine
TypeSmall organic molecule
Emp. Form.C16H20N4O5S
Mol. Mass.380.419
SMILESCN(C)Cc1ccc(CSCCNc2ccc(cc2[N+]([O-])=O)[N+]([O-])=O)o1