Reaction Details
TargetAcetylcholinesterase
LigandBDBM50004652
Substrate/Competitorn/a
Meas. Tech.ChEBML_28294
IC50 76±n/a nM
Citation Valli, MJTang, YKosh, JWChapman, JMSowell, JW Synthesis and cholinergic properties of N-aryl-2-[[[5-[(dimethylamino)methyl]-2-furanyl]methyl]thio]ethylamino analogs of ranitidine. J Med Chem35:3141-7 (1992) Acetylcholinesterase
Name:Acetylcholinesterase
Type:Enzyme
Mol. Mass.:67792.70
Organism:Homo sapiens (Human)
Description:P22303
Residue:614
BDBM50004652
NameBDBM50004652
Synonyms:CHEMBL321605 | [2-(5-Dimethylaminomethyl-furan-2-ylmethylsulfanyl)-ethyl]-(5-hydrazino-2,4-dinitro-phenyl)-amine
TypeSmall organic molecule
Emp. Form.C16H22N6O5S
Mol. Mass.410.448
SMILESCN(C)Cc1ccc(CSCCNc2cc(NN)c(cc2[N+]([O-])=O)[N+]([O-])=O)o1