Reaction Details
TargetCholinesterase
LigandBDBM50004667
Substrate/Competitorn/a
Meas. Tech.ChEBML_41586
IC50 3300±n/a nM
Citation Valli, MJTang, YKosh, JWChapman, JMSowell, JW Synthesis and cholinergic properties of N-aryl-2-[[[5-[(dimethylamino)methyl]-2-furanyl]methyl]thio]ethylamino analogs of ranitidine. J Med Chem35:3141-7 (1992) Cholinesterase
Name:Cholinesterase
Type:Homotetramer
Mol. Mass.:68422.27
Organism:Homo sapiens (Human)
Description:P06276
Residue:602
BDBM50004667
NameBDBM50004667
Synonyms:CHEMBL320291 | N-[2-(5-Dimethylaminomethyl-furan-2-ylmethylsulfanyl)-ethyl]-N'-methyl-4,6-dinitro-benzene-1,3-diamine
TypeSmall organic molecule
Emp. Form.C17H23N5O5S
Mol. Mass.409.46
SMILESCNc1cc(NCCSCc2ccc(CN(C)C)o2)c(cc1[N+]([O-])=O)[N+]([O-])=O