Reaction Details
TargetAcetylcholinesterase
LigandBDBM50004670
Substrate/Competitorn/a
Meas. Tech.ChEBML_28294
IC50 690.0±n/a nM
Citation Valli, MJTang, YKosh, JWChapman, JMSowell, JW Synthesis and cholinergic properties of N-aryl-2-[[[5-[(dimethylamino)methyl]-2-furanyl]methyl]thio]ethylamino analogs of ranitidine. J Med Chem35:3141-7 (1992) Acetylcholinesterase
Name:Acetylcholinesterase
Type:Enzyme
Mol. Mass.:67792.70
Organism:Homo sapiens (Human)
Description:P22303
Residue:614
BDBM50004670
NameBDBM50004670
Synonyms:CHEMBL106936 | N-Benzyl-N'-[2-(5-dimethylaminomethyl-furan-2-ylmethylsulfanyl)-ethyl]-4,6-dinitro-benzene-1,3-diamine
TypeSmall organic molecule
Emp. Form.C23H27N5O5S
Mol. Mass.485.556
SMILESCN(C)Cc1ccc(CSCCNc2cc(NCc3ccccc3)c(cc2[N+]([O-])=O)[N+]([O-])=O)o1