Reaction Details
TargetMuscarinic acetylcholine receptor M2
LigandBDBM50004653
Substrate/Competitorn/a
Meas. Tech.ChEMBL_140041 (CHEMBL744021)
IC50 380±n/a nM
Citation Valli, MJTang, YKosh, JWChapman, JMSowell, JW Synthesis and cholinergic properties of N-aryl-2-[[[5-[(dimethylamino)methyl]-2-furanyl]methyl]thio]ethylamino analogs of ranitidine. J Med Chem35:3141-7 (1992) Muscarinic acetylcholine receptor M2
Name:Muscarinic acetylcholine receptor M2
Type:Enzyme Catalytic Domain
Mol. Mass.:51555.53
Organism:RAT
Description:P10980
Residue:466
BDBM50004653
NameBDBM50004653
Synonyms:CHEMBL106348 | N-(2-Dimethylamino-ethyl)-N'-[2-(5-dimethylaminomethyl-furan-2-ylmethylsulfanyl)-ethyl]-4,6-dinitro-benzene-1,3-diamine
TypeSmall organic molecule
Emp. Form.C20H30N6O5S
Mol. Mass.466.554
SMILESCN(C)CCNc1cc(NCCSCc2ccc(CN(C)C)o2)c(cc1[N+]([O-])=O)[N+]([O-])=O