Reaction Details
TargetMuscarinic acetylcholine receptor M1
LigandBDBM50004674
Substrate/Competitorn/a
Meas. Tech.ChEBML_138550
IC50 530±n/a nM
Citation Valli, MJTang, YKosh, JWChapman, JMSowell, JW Synthesis and cholinergic properties of N-aryl-2-[[[5-[(dimethylamino)methyl]-2-furanyl]methyl]thio]ethylamino analogs of ranitidine. J Med Chem35:3141-7 (1992) Muscarinic acetylcholine receptor M1
Name:Muscarinic acetylcholine receptor M1
Type:Enzyme Catalytic Domain
Mol. Mass.:51400.50
Organism:Mus musculus
Description:Cholinergic, muscarinic 0 0::Q52KQ0
Residue:460
BDBM50004674
NameBDBM50004674
Synonyms:CHEMBL318517 | N-[2-(5-Dimethylaminomethyl-furan-2-ylmethylsulfanyl)-ethyl]-N'-(3-morpholin-4-yl-propyl)-4,6-dinitro-benzene-1,3-diamine
TypeSmall organic molecule
Emp. Form.C23H34N6O6S
Mol. Mass.522.618
SMILESCN(C)Cc1ccc(CSCCNc2cc(NCCCN3CCOCC3)c(cc2[N+]([O-])=O)[N+]([O-])=O)o1