Reaction Details
TargetAdenosine receptor A2b
LigandBDBM50247457
Substrate/Competitorn/a
Meas. Tech.ChEMBL_1677777 (CHEMBL4027920)
EC50 12800±n/a nM
Citation Petrelli, RScortichini, MBelardo, CBoccella, SLuongo, LCapone, FKachler, SVita, PDel Bello, FMaione, SLavecchia, AKlotz, KNCappellacci, L Structure-Based Design, Synthesis, and In Vivo Antinociceptive Effects of Selective A J Med Chem61:305-318 (2018) 
 
Adenosine receptor A2b
Name:Adenosine receptor A2b
Type:G Protein-Coupled Receptor (GPCR)
Mol. Mass.:36341.22
Organism:Homo sapiens (Human)
Description:n/a
Residue:332
BDBM50247457
NameBDBM50247457
Synonyms:CHEMBL4079464
TypeSmall organic molecule
Emp. Form.C14H18ClN5O4
Mol. Mass.355.777
SMILESO[C@@H]1[C@@H](CCl)O[C@H]([C@@H]1O)n1cnc2c(N[C@@H]3CCOC3)ncnc12