Reaction Details
TargetMuscarinic acetylcholine receptor
LigandBDBM50004726
Substrate/Competitorn/a
Meas. Tech.ChEMBL_138302 (CHEMBL744332)
EC50<1±n/a nM
CommentsZero 20220115
Citation Nilsson, BMVargas, HMHacksell, U Urea and 2-imidazolidone derivatives of the muscarinic agents oxotremorine and N-methyl-N-(1-methyl-4-pyrrolidino-2-butynyl)acetamide. J Med Chem35:3270-9 (1992) Muscarinic acetylcholine receptor
Name:Muscarinic acetylcholine receptor
Type:n/a
Mol. Mass.:66272.13
Organism:Cavia porcellus
Description:n/a
Residue:587
BDBM50004726
NameBDBM50004726
Synonyms:1-(1-Methyl-4-pyrrolidin-1-yl-but-2-ynyl)-pyrrolidin-2-one | CHEMBL51682
TypeSmall organic molecule
Emp. Form.C13H20N2O
Mol. Mass.220.3107
SMILESCC(C#CCN1CCCC1)N1CCCC1=O