Reaction Details
TargetD(2) dopamine receptor
LigandBDBM50004808
Substrate/Competitorn/a
Meas. Tech.ChEMBL_63063 (CHEMBL673630)
Ki 0.023000±n/a nM
Citation Mach, RHJackson, JRLuedtke, RRIvins, KJMolinoff, PBEhrenkaufer, RL Effect of N-alkylation on the affinities of analogues of spiperone for dopamine D2 and serotonin 5-HT2 receptors. J Med Chem35:423-30 (1992) D(2) dopamine receptor
Name:D(2) dopamine receptor
Type:G Protein-Coupled Receptor (GPCR)
Mol. Mass.:50931.60
Organism:Rattus norvegicus (rat)
Description:P61169
Residue:444
BDBM50004808
NameBDBM50004808
Synonyms:3-Benzyl-8-[4-(4-fluoro-phenyl)-4-oxo-butyl]-1-phenyl-1,3,8-triaza-spiro[4.5]decan-4-one | CHEMBL134400
TypeSmall organic molecule
Emp. Form.C30H32FN3O2
Mol. Mass.485.5924
SMILESFc1ccc(cc1)C(=O)CCCN1CCC2(CC1)N(CN(Cc1ccccc1)C2=O)c1ccccc1