Reaction Details
TargetATP-binding cassette sub-family C member 4
LigandBDBM50017674
Substrate/Competitorn/a
Meas. Tech.ChEMBL_1678647 (CHEMBL4028924)
IC50>133000±n/a nM
Citation Morgan, REvan Staden, CJChen, YKalyanaraman, NKalanzi, JDunn, RTAfshari, CAHamadeh, HK A multifactorial approach to hepatobiliary transporter assessment enables improved therapeutic compound development. Toxicol Sci136:216-41 (2013) 
 
ATP-binding cassette sub-family C member 4
Name:ATP-binding cassette sub-family C member 4
Type:PROTEIN
Mol. Mass.:149546.12
Organism:Homo sapiens (Human)
Description:ChEMBL_1486828
Residue:1325
BDBM50017674
NameBDBM50017674
Synonyms:(2-Benzhydryloxy-ethyl)-dimethyl-amine 2-(diphenylmethoxy)-N,N-dimethylethanamine Beldin Benadryl CHEMBL657 DIPHENHYDRAMINE Diphen N-[2-(BENZHYDRYLOXY)ETHYL]-N,N-DIMETHYLAMINE US9138431, DIPHENHYDRAMINE (Benadryl) | US9333199, DIPHENHYDRAMINE (Benadryl)
TypeSmall organic molecule
Emp. Form.C17H21NO
Mol. Mass.255.3547
SMILESCN(C)CCOC(c1ccccc1)c1ccccc1