Reaction Details
TargetATP-binding cassette sub-family C member 4
LigandBDBM50207446
Substrate/Competitorn/a
Meas. Tech.ChEMBL_1678647 (CHEMBL4028924)
IC50>133000±n/a nM
Citation Morgan, REvan Staden, CJChen, YKalyanaraman, NKalanzi, JDunn, RTAfshari, CAHamadeh, HK A multifactorial approach to hepatobiliary transporter assessment enables improved therapeutic compound development. Toxicol Sci136:216-41 (2013) 
 
ATP-binding cassette sub-family C member 4
Name:ATP-binding cassette sub-family C member 4
Type:PROTEIN
Mol. Mass.:149546.12
Organism:Homo sapiens (Human)
Description:ChEMBL_1486828
Residue:1325
BDBM50207446
NameBDBM50207446
Synonyms:2-(2-(2-chloro-6-fluorophenylamino)-5-methylphenyl)acetic acid | CHEMBL404108
TypeSmall organic molecule
Emp. Form.C15H13ClFNO2
Mol. Mass.293.721
SMILESCc1ccc(Nc2c(F)cccc2Cl)c(CC(O)=O)c1