Reaction Details
TargetATP-binding cassette sub-family C member 3
LigandBDBM50004704
Substrate/Competitorn/a
Meas. Tech.ChEMBL_1678646 (CHEMBL4028923)
IC50>133000±n/a nM
Citation Morgan, REvan Staden, CJChen, YKalyanaraman, NKalanzi, JDunn, RTAfshari, CAHamadeh, HK A multifactorial approach to hepatobiliary transporter assessment enables improved therapeutic compound development. Toxicol Sci136:216-41 (2013) 
 
ATP-binding cassette sub-family C member 3
Name:ATP-binding cassette sub-family C member 3
Type:PROTEIN
Mol. Mass.:169352.45
Organism:Homo sapiens (Human)
Description:ChEMBL_735421
Residue:1527
BDBM50004704
NameBDBM50004704
Synonyms:(+)-cis-Diltiazem 5-(2-dimethylamino-ethyl)-2-(4-methoxy-phenyl)-4-oxo-2,3,4,5-tetrahydro-benzo[b][1,4]thiazepin-3-yl ester(Diltiazem)Acetic acid Acetic acid (2S,3S)-5-(2-dimethylamino-ethyl)-2-(4-methoxy-phenyl)-4-oxo-2,3,4,5-tetrahydro-benzo[b][1,4]thiazepin-3-yl ester Acetic acid 5-(2-dimethylamino-ethyl)-2-(4-methoxy-phenyl)-4-oxo-2,3,4,5-tetrahydro-benzo[b][1,4]thiazepin-3-yl ester Acetic acid 5-(2-dimethylamino-ethyl)-2-(4-methoxy-phenyl)-4-oxo-2,3,4,5-tetrahydro-benzo[b][1,4]thiazepin-3-yl ester(cis-(+)-Diltiazem) CHEMBL23 DILTIAZEM Diltzac Tiamate cis-Acetic acid 5-(2-dimethylamino-ethyl)-2-(4-methoxy-phenyl)-4-oxo-2,3,4,5-tetrahydro-benzo[b][1,4]thiazepin-3-yl ester | diltiazem;Acetic acid 5-(2-dimethylamino-ethyl)-2-(4-methoxy-phenyl)-4-oxo-2,3,4,5-tetrahydro-benzo[b][1,4]thiazepin-3-yl ester
TypeSmall organic molecule
Emp. Form.C22H26N2O4S
Mol. Mass.414.518
SMILESCOc1ccc(cc1)[C@@H]1Sc2ccccc2N(CCN(C)C)C(=O)[C@@H]1OC(C)=O