Reaction Details
TargetBile salt export pump
LigandBDBM50371235
Substrate/Competitorn/a
Meas. Tech.ChEMBL_1678644 (CHEMBL4028921)
IC50>133000±n/a nM
Citation Morgan, REvan Staden, CJChen, YKalyanaraman, NKalanzi, JDunn, RTAfshari, CAHamadeh, HK A multifactorial approach to hepatobiliary transporter assessment enables improved therapeutic compound development. Toxicol Sci136:216-41 (2013) 
 
Bile salt export pump
Name:Bile salt export pump
Type:Protein
Mol. Mass.:146405.49
Organism:Homo sapiens (Human)
Description:O95342
Residue:1321
BDBM50371235
NameBDBM50371235
Synonyms:CIPROFIBRATE
TypeSmall organic molecule
Emp. Form.C13H14Cl2O3
Mol. Mass.289.154
SMILESCC(C)(Oc1ccc(cc1)C1CC1(Cl)Cl)C(O)=O