Reaction Details
TargetBile salt export pump
LigandBDBM50011977
Substrate/Competitorn/a
Meas. Tech.ChEMBL_1678644 (CHEMBL4028921)
IC50>133000±n/a nM
Citation Morgan, REvan Staden, CJChen, YKalyanaraman, NKalanzi, JDunn, RTAfshari, CAHamadeh, HK A multifactorial approach to hepatobiliary transporter assessment enables improved therapeutic compound development. Toxicol Sci136:216-41 (2013) 
 
Bile salt export pump
Name:Bile salt export pump
Type:Protein
Mol. Mass.:146405.49
Organism:Homo sapiens (Human)
Description:O95342
Residue:1321
BDBM50011977
NameBDBM50011977
Synonyms:(E)-2-butyl-1-(p-carboxybenzyl)-alpha-2-thenylimidazole-5-acrylic acid (E)-alpha{[2-butyl-1-[(4-carboxyphenyl)methyl]-1H-imidazole-5-yl]methylene}-2-thiopheneproprionic acid CHEMBL813 | EPROSARTAN
TypeSmall organic molecule
Emp. Form.C23H24N2O4S
Mol. Mass.424.513
SMILESCCCCc1ncc(\C=C(/Cc2cccs2)C(O)=O)n1Cc1ccc(cc1)C(O)=O