Reaction Details
TargetATP-binding cassette sub-family C member 2
LigandBDBM50118470
Substrate/Competitorn/a
Meas. Tech.ChEMBL_1678645 (CHEMBL4028922)
IC50>133000±n/a nM
Citation Morgan, REvan Staden, CJChen, YKalyanaraman, NKalanzi, JDunn, RTAfshari, CAHamadeh, HK A multifactorial approach to hepatobiliary transporter assessment enables improved therapeutic compound development. Toxicol Sci136:216-41 (2013) 
 
ATP-binding cassette sub-family C member 2
Name:ATP-binding cassette sub-family C member 2
Type:Protein
Mol. Mass.:174229.45
Organism:Homo sapiens (Human)
Description:Q92887
Residue:1545
BDBM50118470
NameBDBM50118470
Synonyms:CHEMBL1218 RAMELTEON | Rozerem
TypeSmall organic molecule
Emp. Form.C16H21NO2
Mol. Mass.259.3434
SMILESCCC(=O)NCC[C@@H]1CCc2ccc3OCCc3c12