Reaction Details
TargetATP-binding cassette sub-family C member 2
LigandBDBM94597
Substrate/Competitorn/a
Meas. Tech.ChEMBL_1678645 (CHEMBL4028922)
IC50>133000±n/a nM
Citation Morgan, REvan Staden, CJChen, YKalyanaraman, NKalanzi, JDunn, RTAfshari, CAHamadeh, HK A multifactorial approach to hepatobiliary transporter assessment enables improved therapeutic compound development. Toxicol Sci136:216-41 (2013) 
 
ATP-binding cassette sub-family C member 2
Name:ATP-binding cassette sub-family C member 2
Type:Protein
Mol. Mass.:174229.45
Organism:Homo sapiens (Human)
Description:Q92887
Residue:1545
BDBM94597
NameBDBM94597
Synonyms:(Z)-2-butenedioate;10-(1-methyl-4-piperidinylidene)-5H-benzo[1,2]cyclohepta[3,4-b]thiophen-4-one 10-(1-methyl-4-piperidylidene)-5H-benzo[1,2]cyclohepta[3,4-b]thiophen-4-one;maleate Ketotifen fumarate SMR001307257 US9333199, KETOTIFEN cid_5282408
TypeSmall organic molecule
Emp. Form.C19H19NOS
Mol. Mass.309.425
SMILES[#6]-[#7]-1-[#6]-[#6]\[#6](-[#6]-[#6]-1)=[#6]-1/c2ccsc2-[#6](=O)-[#6]-c2ccccc-12