Reaction Details
TargetATP-binding cassette sub-family C member 4
LigandBDBM86731
Substrate/Competitorn/a
Meas. Tech.ChEMBL_1678647 (CHEMBL4028924)
IC50 8000±n/a nM
Citation Morgan, REvan Staden, CJChen, YKalyanaraman, NKalanzi, JDunn, RTAfshari, CAHamadeh, HK A multifactorial approach to hepatobiliary transporter assessment enables improved therapeutic compound development. Toxicol Sci136:216-41 (2013) 
 
ATP-binding cassette sub-family C member 4
Name:ATP-binding cassette sub-family C member 4
Type:PROTEIN
Mol. Mass.:149546.12
Organism:Homo sapiens (Human)
Description:ChEMBL_1486828
Residue:1325
BDBM86731
NameBDBM86731
Synonyms:CAS_74191-85-8 UK 33,274
TypeSmall organic molecule
Emp. Form.C23H25N5O5
Mol. Mass.451.4751
SMILESCOc1cc2nc(nc(N)c2cc1OC)N1CCN(CC1)C(=O)C1COc2ccccc2O1