Reaction Details
TargetBile salt export pump
LigandBDBM21613
Substrate/Competitorn/a
Meas. Tech.ChEMBL_1678644 (CHEMBL4028921)
IC50 41500±n/a nM
Citation Morgan, REvan Staden, CJChen, YKalyanaraman, NKalanzi, JDunn, RTAfshari, CAHamadeh, HK A multifactorial approach to hepatobiliary transporter assessment enables improved therapeutic compound development. Toxicol Sci136:216-41 (2013) 
 
Bile salt export pump
Name:Bile salt export pump
Type:Protein
Mol. Mass.:146405.49
Organism:Homo sapiens (Human)
Description:O95342
Residue:1321
BDBM21613
NameBDBM21613
Synonyms:2-[(2E)-3-(3,4-dimethoxyphenyl)prop-2-enamido]benzoic acid Rizaben | Tranilast
TypeSmall organic molecule
Emp. Form.C18H17NO5
Mol. Mass.327.3313
SMILESCOc1ccc(\C=C\C(=O)Nc2ccccc2C(O)=O)cc1OC