Reaction Details
TargetATP-binding cassette sub-family C member 3
LigandBDBM23406
Substrate/Competitorn/a
Meas. Tech.ChEMBL_1678646 (CHEMBL4028923)
IC50>133000±n/a nM
Citation Morgan, REvan Staden, CJChen, YKalyanaraman, NKalanzi, JDunn, RTAfshari, CAHamadeh, HK A multifactorial approach to hepatobiliary transporter assessment enables improved therapeutic compound development. Toxicol Sci136:216-41 (2013) 
 
ATP-binding cassette sub-family C member 3
Name:ATP-binding cassette sub-family C member 3
Type:PROTEIN
Mol. Mass.:169352.45
Organism:Homo sapiens (Human)
Description:ChEMBL_735421
Residue:1527
BDBM23406
NameBDBM23406
Synonyms:(3R,4R,5S,6R)-5-{[(2R,3R,4R,5S,6R)-5-{[(2R,3R,4S,5S,6R)-3,4-dihydroxy-6-methyl-5-{[(1S,4R,5S,6S)-4,5,6-trihydroxy-3-(hydroxymethyl)cyclohex-2-en-1-yl]amino}oxan-2-yl]oxy}-3,4-dihydroxy-6-(hydroxymethyl)oxan-2-yl]oxy}-6-(hydroxymethyl)oxane-2,3,4-triol US11292789, Acarbose
TypeCarbohydrate
Emp. Form.C25H43NO18
Mol. Mass.645.6048
SMILESC[C@H]1O[C@H](O[C@@H]2[C@@H](CO)O[C@H](O[C@@H]3[C@@H](CO)OC(O)[C@H](O)[C@H]3O)[C@H](O)[C@H]2O)[C@H](O)[C@@H](O)[C@@H]1N[C@H]1C=C(CO)[C@@H](O)[C@H](O)[C@H]1O