Reaction Details
TargetATP-binding cassette sub-family C member 4
LigandBDBM92862
Substrate/Competitorn/a
Meas. Tech.ChEMBL_1678647 (CHEMBL4028924)
IC50>133000±n/a nM
Citation Morgan, REvan Staden, CJChen, YKalyanaraman, NKalanzi, JDunn, RTAfshari, CAHamadeh, HK A multifactorial approach to hepatobiliary transporter assessment enables improved therapeutic compound development. Toxicol Sci136:216-41 (2013) 
 
ATP-binding cassette sub-family C member 4
Name:ATP-binding cassette sub-family C member 4
Type:PROTEIN
Mol. Mass.:149546.12
Organism:Homo sapiens (Human)
Description:ChEMBL_1486828
Residue:1325
BDBM92862
NameBDBM92862
Synonyms:US9284315, BEZ-235 | mTOR Inhibitor, BEZ235
TypeSmall molecule
Emp. Form.C30H23N5O
Mol. Mass.469.5365
SMILESCn1c2cnc3ccc(cc3c2n(-c2ccc(cc2)C(C)(C)C#N)c1=O)-c1cnc2ccccc2c1