Reaction Details
TargetATP-binding cassette sub-family C member 4
LigandBDBM357857
Substrate/Competitorn/a
Meas. Tech.ChEMBL_1678647 (CHEMBL4028924)
IC50 2200±n/a nM
Citation Morgan, REvan Staden, CJChen, YKalyanaraman, NKalanzi, JDunn, RTAfshari, CAHamadeh, HK A multifactorial approach to hepatobiliary transporter assessment enables improved therapeutic compound development. Toxicol Sci136:216-41 (2013) 
 
ATP-binding cassette sub-family C member 4
Name:ATP-binding cassette sub-family C member 4
Type:PROTEIN
Mol. Mass.:149546.12
Organism:Homo sapiens (Human)
Description:ChEMBL_1486828
Residue:1325
BDBM357857
NameBDBM357857
Synonyms:Aphthasol | US10214536, Amlexanox
TypeSmall organic molecule
Emp. Form.C16H14N2O4
Mol. Mass.298.2934
SMILESCC(C)c1ccc2oc3nc(N)c(cc3c(=O)c2c1)C(O)=O