Reaction Details
TargetATP-binding cassette sub-family C member 4
LigandBDBM50158460
Substrate/Competitorn/a
Meas. Tech.ChEMBL_1678647 (CHEMBL4028924)
IC50 17000±n/a nM
Citation Morgan, REvan Staden, CJChen, YKalyanaraman, NKalanzi, JDunn, RTAfshari, CAHamadeh, HK A multifactorial approach to hepatobiliary transporter assessment enables improved therapeutic compound development. Toxicol Sci136:216-41 (2013) 
 
ATP-binding cassette sub-family C member 4
Name:ATP-binding cassette sub-family C member 4
Type:PROTEIN
Mol. Mass.:149546.12
Organism:Homo sapiens (Human)
Description:ChEMBL_1486828
Residue:1325
BDBM50158460
NameBDBM50158460
Synonyms:(3,5-dibromo-4-hydroxyphenyl)(2-ethyl-1-benzofuran-3-yl)methanone 3,5-dibromo-4-hydroxyphenyl-2-ethyl-3-benzofuranyl ketone CHEMBL388590 US9856239, benzbromarone Uroleap (TN) | cid_2333
TypeSmall organic molecule
Emp. Form.C17H12Br2O3
Mol. Mass.424.083
SMILESCCc1oc2ccccc2c1C(=O)c1cc(Br)c(O)c(Br)c1