Reaction Details
TargetATP-binding cassette sub-family C member 4
LigandBDBM50436176
Substrate/Competitorn/a
Meas. Tech.ChEMBL_1678647 (CHEMBL4028924)
IC50>133000±n/a nM
Citation Morgan, REvan Staden, CJChen, YKalyanaraman, NKalanzi, JDunn, RTAfshari, CAHamadeh, HK A multifactorial approach to hepatobiliary transporter assessment enables improved therapeutic compound development. Toxicol Sci136:216-41 (2013) 
 
ATP-binding cassette sub-family C member 4
Name:ATP-binding cassette sub-family C member 4
Type:PROTEIN
Mol. Mass.:149546.12
Organism:Homo sapiens (Human)
Description:ChEMBL_1486828
Residue:1325
BDBM50436176
NameBDBM50436176
Synonyms:Dynacirc ISRADIPINE PN-200-110
TypeSmall organic molecule
Emp. Form.C19H21N3O5
Mol. Mass.371.3871
SMILESCOC(=O)C1=C(C)NC(C)=C(C1c1cccc2nonc12)C(=O)OC(C)C