Reaction Details
TargetATP-binding cassette sub-family C member 3
LigandBDBM50237590
Substrate/Competitorn/a
Meas. Tech.ChEMBL_1678646 (CHEMBL4028923)
IC50 6390±n/a nM
Citation Morgan, REvan Staden, CJChen, YKalyanaraman, NKalanzi, JDunn, RTAfshari, CAHamadeh, HK A multifactorial approach to hepatobiliary transporter assessment enables improved therapeutic compound development. Toxicol Sci136:216-41 (2013) 
 
ATP-binding cassette sub-family C member 3
Name:ATP-binding cassette sub-family C member 3
Type:PROTEIN
Mol. Mass.:169352.45
Organism:Homo sapiens (Human)
Description:ChEMBL_735421
Residue:1527
BDBM50237590
NameBDBM50237590
Synonyms:Amaryl Glimepiride Niddaryl
TypeSmall organic molecule
Emp. Form.C24H34N4O5S
Mol. Mass.490.616
SMILESCCC1=C(C)CN(C(=O)NCCc2ccc(cc2)S(=O)(=O)NC(=O)N[C@H]2CC[C@H](C)CC2)C1=O