Reaction Details
TargetATP-binding cassette sub-family C member 4
LigandBDBM21613
Substrate/Competitorn/a
Meas. Tech.ChEMBL_1678647 (CHEMBL4028924)
IC50 1000±n/a nM
Citation Morgan, REvan Staden, CJChen, YKalyanaraman, NKalanzi, JDunn, RTAfshari, CAHamadeh, HK A multifactorial approach to hepatobiliary transporter assessment enables improved therapeutic compound development. Toxicol Sci136:216-41 (2013) 
 
ATP-binding cassette sub-family C member 4
Name:ATP-binding cassette sub-family C member 4
Type:PROTEIN
Mol. Mass.:149546.12
Organism:Homo sapiens (Human)
Description:ChEMBL_1486828
Residue:1325
BDBM21613
NameBDBM21613
Synonyms:2-[(2E)-3-(3,4-dimethoxyphenyl)prop-2-enamido]benzoic acid Rizaben | Tranilast
TypeSmall organic molecule
Emp. Form.C18H17NO5
Mol. Mass.327.3313
SMILESCOc1ccc(\C=C\C(=O)Nc2ccccc2C(O)=O)cc1OC