Reaction Details
TargetGrowth hormone-releasing hormone receptor
LigandBDBM50004969
Substrate/Competitorn/a
Meas. Tech.ChEBML_72520
IC50 9.5±n/a nM
Citation Gaudreau, PBoulanger, LAbribat, T Affinity of human growth hormone-releasing factor (1-29)NH2 analogues for GRF binding sites in rat adenopituitary. J Med Chem35:1864-9 (1992) Growth hormone-releasing hormone receptor
Name:Growth hormone-releasing hormone receptor
Type:PROTEIN
Mol. Mass.:51523.38
Organism:Rattus norvegicus
Description:ChEMBL_193173
Residue:464
BDBM50004969
NameBDBM50004969
Synonyms:CHEMBL266658 | GRF-analogues
TypeSmall organic molecule
Emp. Form.C144H237N43O41
Mol. Mass.3226.6861
SMILESCC[C@H](C)[C@H](NC(=O)[C@H](C)NC(=O)[C@H](CC(O)=O)NC(=O)[C@H](C)NC(=O)[C@@H](N)Cc1ccc(O)cc1)C(=O)N[C@@H](Cc1ccccc1)C(=O)N[C@@H]([C@@H](C)O)C(=O)N[C@@H](CC(N)=O)C(=O)N[C@@H](CO)C(=O)N[C@@H](Cc1ccc(O)cc1)C(=O)N[C@@H](CCCNC(N)=N)C(=O)N[C@@H](CCCCN)C(=O)N[C@@H](C(C)C)C(=O)N[C@@H](CC(C)C)C(=O)NCC(=O)N[C@@H](CCC(N)=O)C(=O)N[C@@H](CC(C)C)C(=O)N[C@@H](CO)C(=O)N[C@@H](C)C(=O)N[C@@H](CCCNC(N)=N)C(=O)N[C@@H](CCCCN)C(=O)N[C@@H](CC(C)C)C(=O)N[C@@H](CC(C)C)C(=O)N[C@@H](CCC(N)=O)C(=O)N[C@@H](CC(O)=O)C(=O)N[C@@H]([C@@H](C)CC)C(=O)N[C@@H](CO)C(=O)N[C@@H](CCCNC(N)=N)C(N)=O