Reaction Details
TargetSphingosine 1-phosphate receptor 3
LigandBDBM50147706
Substrate/Competitorn/a
Meas. Tech.ChEMBL_1679172 (CHEMBL4029449)
IC50 7.0±n/a nM
Citation Dyckman, AJ Modulators of Sphingosine-1-phosphate Pathway Biology: Recent Advances of Sphingosine-1-phosphate Receptor 1 (S1P J Med Chem60:5267-5289 (2017) 
 
Sphingosine 1-phosphate receptor 3
Name:Sphingosine 1-phosphate receptor 3
Type:G Protein-Coupled Receptor (GPCR)
Mol. Mass.:42278.13
Organism:Homo sapiens (Human)
Description:Q99500
Residue:378
BDBM50147706
NameBDBM50147706
Synonyms:CHEMBL114584 | [3-Amino-3-hydroxymethyl-5-(4-octyl-phenyl)-pentyl]-phosphonic acid
TypeSmall organic molecule
Emp. Form.C20H36NO4P
Mol. Mass.385.4779
SMILESCCCCCCCCc1ccc(CCC(N)(CO)CCP(O)(O)=O)cc1