Reaction Details
TargetSphingosine 1-phosphate receptor 1
LigandBDBM50248365
Substrate/Competitorn/a
Meas. Tech.ChEMBL_1679175 (CHEMBL4029452)
IC50 18±n/a nM
Citation Dyckman, AJ Modulators of Sphingosine-1-phosphate Pathway Biology: Recent Advances of Sphingosine-1-phosphate Receptor 1 (S1P J Med Chem60:5267-5289 (2017) 
 
Sphingosine 1-phosphate receptor 1
Name:Sphingosine 1-phosphate receptor 1
Type:Enzyme
Mol. Mass.:42836.02
Organism:Homo sapiens (Human)
Description:P21453
Residue:382
BDBM50248365
NameBDBM50248365
Synonyms:CHEMBL4090982
TypeSmall organic molecule
Emp. Form.C19H29NO2
Mol. Mass.303.4391
SMILESCCCCCCCCc1ccc(CN2CC(C2)C(O)=O)cc1